(CO)3CrC6H5 anion
- Formula: C9H5CrO3-
- Molecular weight: 213.1308

Reaction thermochemistry data

Data compiled by: John E. Bartmess
Individual Reactions
By formula: C9H5CrO3- + H+ = C9H6CrO3
Quantity | Value | Units | Method | Reference | Comment |
---|---|---|---|---|---|
ΔrH° | 371.5 ± 5.0 | kcal/mol | IMRB | Lane and Squires, 1985 | gas phase |

Gas phase ion energetics data

Data compiled by: John E. Bartmess
Protonation reactions
By formula: C9H5CrO3- + H+ = C9H6CrO3
Quantity | Value | Units | Method | Reference | Comment |
---|---|---|---|---|---|
ΔrH° | 371.5 ± 5.0 | kcal/mol | IMRB | Lane and Squires, 1985 | gas phase |

References

Lane and Squires, 1985
Lane, K.R.; Squires, R.R.,
Formation of HCr(CO)3- from the remarkable reaction of hydride ion with benzenechromium tricarbonyl,
J. Am. Chem. Soc., 1985, 107, 6403. [all data]