Et(Me)N anion
- Formula: C3H8N-
- Molecular weight: 58.1029

Gas phase ion energetics data

Data compiled by: John E. Bartmess
Electron affinity of neutral species
EAneutral (eV) | Method | Reference | Comment |
---|---|---|---|
0.43 ± 0.13 | D-EA | Ingemann and Nibbering, 1985 |
Protonation reactions
By formula: C3H8N- + H+ = C3H9N
Quantity | Value | Units | Method | Reference | Comment |
---|---|---|---|---|---|
ΔrH° | 395.1 ± 2.1 | kcal/mol | G+TS | Ingemann and Nibbering, 1985 | gas phase |
Quantity | Value | Units | Method | Reference | Comment |
ΔrG° | 387.4 ± 2.0 | kcal/mol | IMRE | Ingemann and Nibbering, 1985 | gas phase |

References

Ingemann and Nibbering, 1985
Ingemann, S.; Nibbering, N.M.M.,
Gas-phase acidity of CH3X [X = P(CH3)2, SCH3, F, Cl, Br, I] compounds,
J. Chem. Soc. Perkin Trans. 2, 1985, 837. [all data]