3-Me-4-NO2-phenoxide anion

Gas phase ion energetics data

Data compiled by: John E. Bartmess

Electron affinity of neutral species

EAneutral (eV) Method Reference Comment
3.37 ± 0.16D-EAFujio, McIver, et al., 1981value altered from reference due to change in acidity scale

Protonation reactions

C7H6NO3- + Hydrogen cation = Phenol, 3-methyl-4-nitro-

By formula: C7H6NO3- + H+ = C7H7NO3

Quantity Value Units Method Reference Comment
Δr1380. ± 8.8kJ/molG+TSFujio, McIver, et al., 1981gas phase; value altered from reference due to change in acidity scale
Quantity Value Units Method Reference Comment
Δr1350. ± 8.4kJ/molIMREFujio, McIver, et al., 1981gas phase; value altered from reference due to change in acidity scale

References

Fujio, McIver, et al., 1981
Fujio, M.; McIver, R.T., Jr.; Taft, R.W., Effects on the acidities of phenols from specific substituent-solvent interactions. Inherent substituent parameters from gas phase acidities, J. Am. Chem. Soc., 1981, 103, 4017. [all data]