EtOH..F anion
- Formula: C2H6FO-
- Molecular weight: 65.0674

Reaction thermochemistry data

Data compiled by: John E. Bartmess
Individual Reactions
C2H6FO- + 2 = C4H12FO2-
By formula: C2H6FO- + 2C2H6O = C4H12FO2-
Quantity | Value | Units | Method | Reference | Comment |
---|---|---|---|---|---|
ΔrH° | 20.60 ± 0.30 | kcal/mol | TDAs | Bogdanov, Peschke, et al., 1999 | gas phase |
Quantity | Value | Units | Method | Reference | Comment |
ΔrG° | 12.10 | kcal/mol | TDAs | Bogdanov, Peschke, et al., 1999 | gas phase |

Ion clustering data

Data compiled by: John E. Bartmess
Clustering reactions
C2H6FO- + 2 = C4H12FO2-
By formula: C2H6FO- + 2C2H6O = C4H12FO2-
Quantity | Value | Units | Method | Reference | Comment |
---|---|---|---|---|---|
ΔrH° | 20.60 ± 0.30 | kcal/mol | TDAs | Bogdanov, Peschke, et al., 1999 | gas phase |
Quantity | Value | Units | Method | Reference | Comment |
ΔrG° | 12.10 | kcal/mol | TDAs | Bogdanov, Peschke, et al., 1999 | gas phase |

Gas phase thermochemistry data

Data compiled by: John E. Bartmess
Quantity | Value | Units | Method | Reference | Comment |
---|---|---|---|---|---|
ΔfH°gas | -148.08 ± 0.71 | kcal/mol | Ther | Bogdanov, Peschke, et al., 1999 |

References

Bogdanov, Peschke, et al., 1999
Bogdanov, B.; Peschke, M.; Tonner, D.S.; Szulejko, J.E.; McMahon, T.B.,
Stepwise solvation of halides by alcohol molecules in the gas phase,
Int. J. Mass Spectrom., 1999, 187, 707-725, https://doi.org/10.1016/S1387-3806(98)14180-5
. [all data]