FSO3 anion

Reaction thermochemistry data

Data compiled by: John E. Bartmess

Individual Reactions

FO3S- + Hydrogen cation = fluorosulphuric acid

By formula: FO3S- + H+ = HFO3S

Quantity Value Units Method Reference Comment
Δr1285. ± 11.kJ/molG+TSViggiano, Henchman, et al., 1992gas phase
Δr1301.7kJ/molAcidLarson and McMahon, 1985gas phase; These relative affinities are ca. 10 kcal/mol weaker than threshold values (see Wenthold and Squires, 1995) for donors greater than ca. 27 kcal/mol in free energy. This discrepancy has not yet been resolved, though the stronger value appears preferable.
Δr<1312. ± 8.4kJ/molEIAEAdams, Smith, et al., 1986gas phase; From FSO3H (AP 0eV)
Quantity Value Units Method Reference Comment
Δr1255. ± 10.kJ/molIMRBViggiano, Henchman, et al., 1992gas phase
Δr1272.0 ± 1.3kJ/molH-TSLarson and McMahon, 1985gas phase; These relative affinities are ca. 10 kcal/mol weaker than threshold values (see Wenthold and Squires, 1995) for donors greater than ca. 27 kcal/mol in free energy. This discrepancy has not yet been resolved, though the stronger value appears preferable.
Δr<1282. ± 13.kJ/molH-TSAdams, Smith, et al., 1986gas phase; From FSO3H (AP 0eV)

References

Viggiano, Henchman, et al., 1992
Viggiano, A.A.; Henchman, M.J.; Dale, F.; Deakyne, C.A.; Paulson, J.F., Gas-Phase Reactions of Weak Bronsted Bases I-, PO3-, HSO4-, FSO3-, and CF3SO3- with Strong Bronsted Acids H2SO4, FSO3H, and CF3SO3H - A Quantitative Study, J. Am. Chem. Soc., 1992, 114, 11, 4299, https://doi.org/10.1021/ja00037a039 . [all data]

Larson and McMahon, 1985
Larson, J.W.; McMahon, T.B., Fluoride and chloride affinities of the main group oxides, fluorides, oxofluorides, and alkyls. Quantitative scales of lewis acidities from ICR halide exchange equilibria, J. Am. Chem. Soc., 1985, 107, 766. [all data]

Wenthold and Squires, 1995
Wenthold, P.G.; Squires, R.R., Bond dissociation energies of F2(-) and HF2(-). A gas-phase experimental and G2 theoretical study, J. Phys. Chem., 1995, 99, 7, 2002, https://doi.org/10.1021/j100007a034 . [all data]

Adams, Smith, et al., 1986
Adams, N.G.; Smith, D.; Viggiano, A.A.; Paulson, J.F.; Henchman, M.J., Dissociative attachment reactions of electron with strong acid molecules, J. Chem. Phys., 1986, 84, 6728. [all data]