cis-CD3CDCDO-

Vibrational and/or electronic energy levels

Data compiled by: Marilyn E. Jacox

State:   ?

 Energy
 (cm-1
 Med.   Transition   λmin
 (nm)
 λmax
 (nm)

References

Td = 12933 ± 16 gas Yacovitch, Kim, et al., 2011

Yacovitch, Kim, et al., 2011
Yacovitch, T.I.; Kim, J.B.; Garand, E.; van der Poll, D.G.; Neumark, D.M., Slow photoelectron velocity-map imaging spectroscopy of the n-methylvinoxide anion, J. Chem. Phys., 2011, 134, 13, 134307, https://doi.org/10.1063/1.3572269 . [all data]