MgCCCCD
- Formula: C4DMg
- Molecular weight: 74.3619

Vibrational and/or electronic energy levels

Data compiled by: Marilyn E. Jacox
State: A
Energy (cm-1) |
Med. | Transition | λmin (nm) |
λmax (nm) |
References | ||
---|---|---|---|---|---|---|---|
To = 22436.74 | gas | A-X | Jochnowitz, Chasovskikh, et al., 2009 | ||||

References

Jochnowitz, Chasovskikh, et al., 2009
Jochnowitz, E.B.; Chasovskikh, E.; Maier, J.P.,
The -- electronic transition in,
J. Mol. Spectrosc., 2009, 254, 1, 53, https://doi.org/10.1016/j.jms.2008.12.005
. [all data]