ClDBr-

Vibrational and/or electronic energy levels

Data compiled by: Marilyn E. Jacox

State:   X

Vib.
sym.
 No.   Approximate
 type of mode
 cm-1   Med.   Method   References

Σ+ 3 Asym. stretch 524 Cs Ar IR 1976AUL/AND1986

References

No reference data available.