D(CC)2CN+

Vibrational and/or electronic energy levels

Data compiled by: Marilyn E. Jacox

State:   A

 Energy
 (cm-1
 Med.   Transition   λmin
 (nm)
 λmax
 (nm)

References

To = 17188.50 gas Sinclair, Pfluger, et al., 1999

Sinclair, Pfluger, et al., 1999
Sinclair, W.E.; Pfluger, D.; Maier, J.P., Rotationally resolved A [sup 2]Π←X [sup 2]Π electronic spectra of cyanodiacetylene and dicyanoacetylene cations, J. Chem. Phys., 1999, 111, 21, 9600, https://doi.org/10.1063/1.480293 . [all data]