Fe2O3-

Vibrational and/or electronic energy levels

Data compiled by: Marilyn E. Jacox

State:   ?

 Energy
 (cm-1
 Med.   Transition   λmin
 (nm)
 λmax
 (nm)

References

Td = 24690 ± 320 gas Wu, Desai, et al., 1996

Additional references: Jacox, 1998, page 295

Wu, Desai, et al., 1996
Wu, H.; Desai, R.; Wang, L.-S., Observation and Photoelectron Spectroscopic Study of Novel Mono- and Di-iron Oxide Molecules: FeOy- (y=1-4) and Fe2Oy- (y=1-5), J. Am. Chem. Soc., 1996, 118, 22, 5296, https://doi.org/10.1021/ja954153b . [all data]

Jacox, 1998
Jacox, M.E., Vibrational and electronic energy levels of polyatomic transient molecules: supplement A, J. Phys. Chem. Ref. Data, 1998, 27, 2, 115-393, https://doi.org/10.1063/1.556017 . [all data]