ClLiCl

Vibrational and/or electronic energy levels

Data compiled by: Marilyn E. Jacox

State:   A

 Energy
 (cm-1
 Med.   Transition   λmin
 (nm)
 λmax
 (nm)

References

Txx = 2140 ± 450 gas Wang, Ding, et al., 1999

Additional references: Jacox, 2003, page 115

Wang, Ding, et al., 1999
Wang, X.-B.; Ding, C.-F.; Wang, L.-S.; Boldyrev, A.I.; Simons, J., First experimental photoelectron spectra of superhalogens and their theoretical interpretations, J. Chem. Phys., 1999, 110, 10, 4763, https://doi.org/10.1063/1.478386 . [all data]

Jacox, 2003
Jacox, M.E., Vibrational and electronic energy levels of polyatomic transient molecules: supplement B, J. Phys. Chem. Ref. Data, 2003, 32, 1, 1-441, https://doi.org/10.1063/1.1497629 . [all data]