CH3NH-
- Formula: CH4N-
- Molecular weight: 30.0497

Vibrational and/or electronic energy levels

Data compiled by: Marilyn E. Jacox
State: ?
Energy (cm-1) |
Med. | Transition | λmin (nm) |
λmax (nm) |
References | ||
---|---|---|---|---|---|---|---|
Td = 3485 ± 120 | gas | Radisic, Xu, et al., 2002 | |||||

References

Radisic, Xu, et al., 2002
Radisic, D.; Xu, S.; Bowen, K.H., Jr.,
Photoelectron spectroscopy of the anions, CH3NH- and (CH3)2N- and the anion complexes, H-(CH3NH2) and (CH3)2N-[(CH3)2NH],
Chem. Phys. Lett., 2002, 354, 1-2, 9, https://doi.org/10.1016/S0009-2614(01)01470-1
. [all data]