Al3O2

Vibrational and/or electronic energy levels

Data compiled by: Marilyn E. Jacox

State:   C

 Energy
 (cm-1
 Med.   Transition   λmin
 (nm)
 λmax
 (nm)

References

To = 23400 ± 800 gas Wu, Li, et al., 1998

State:   B

 Energy
 (cm-1
 Med.   Transition   λmin
 (nm)
 λmax
 (nm)

Tp = 19930 ± 940 gas Wu, Li, et al., 1998

State:   A

 Energy
 (cm-1
 Med.   Transition   λmin
 (nm)
 λmax
 (nm)

Tp = 10970 ± 630 gas Wu, Li, et al., 1998

Additional references: Jacox, 2003, page 283

Wu, Li, et al., 1998
Wu, H.; Li, X.; Wang, X.-B.; Ding, C.-F.; Wang, L.-S., Al3Oy (y=0-5) Clusters: Sequential Oxidation, Metal-to-oxide Transformation, and Photoisomerization., J. Chem. Phys., 1998, 109, 2, 449, https://doi.org/10.1063/1.476583 . [all data]

Jacox, 2003
Jacox, M.E., Vibrational and electronic energy levels of polyatomic transient molecules: supplement B, J. Phys. Chem. Ref. Data, 2003, 32, 1, 1-441, https://doi.org/10.1063/1.1497629 . [all data]