Al2P2-

Vibrational and/or electronic energy levels

Data compiled by: Marilyn E. Jacox

State:   ?

 Energy
 (cm-1
 Med.   Transition   λmin
 (nm)
 λmax
 (nm)

References

Td = 17350 ± 800 gas Gomez, Taylor, et al., 2001

Additional references: Jacox, 2003, page 217

Gomez, Taylor, et al., 2001
Gomez, H.; Taylor, T.R.; Neumark, D.M., Anion Photoelectron Spectroscopy of Aluminum Phosphide Clusters, J. Phys. Chem. A, 2001, 105, 28, 6886, https://doi.org/10.1021/jp0105544 . [all data]

Jacox, 2003
Jacox, M.E., Vibrational and electronic energy levels of polyatomic transient molecules: supplement B, J. Phys. Chem. Ref. Data, 2003, 32, 1, 1-441, https://doi.org/10.1063/1.1497629 . [all data]