3-Vanilpropanol, bis(trimethylsilyl)-

Van Den Dool and Kratz RI, non-polar column, temperature ramp

Data compiled by: NIST Mass Spectrometry Data Center, William E. Wallace, director

Column type Packed
Active phase OV-1
Column length (m) 2.
Carrier gas N2
Substrate Supelcoport
Column diameter (mm)
Phase thickness (μm)
Tstart (C) 80.
Tend (C) 240.
Heat rate (K/min) 4.
Initial hold (min)
Final hold (min)
I 1813.
ReferenceMattsson and Petersson, 1977
Comment MSDC-RI

References

Mattsson and Petersson, 1977
Mattsson, M.; Petersson, G., Reference GLC Data for the Analysis of Phenolic Compounds as Trimethylsilyl Derivatives, J. Chromatogr. Sci., 1977, 15, 12, 546-554, https://doi.org/10.1093/chromsci/15.12.546 . [all data]