17β-Hydroxy-5α-androstane-3,6-dione, TMS derivative

Kovats' RI, non-polar column, isothermal

Data compiled by: NIST Mass Spectrometry Data Center, William E. Wallace, director

Column type Packed
Active phase OV-101
Column length (m) 2.1
Carrier gas N2
Substrate Gas-Chrom Q
Column diameter (mm)
Phase thickness (μm)
Temperature (C) 263.
I 2920.
ReferenceKerebel, Morfin, et al., 1977
Comment MSDC-RI

References

Kerebel, Morfin, et al., 1977
Kerebel, A.; Morfin, R.F.; Berthou, F.L.; Picart, D.; Bardou, L.G.; Floch, H.H., Analysis of C19O3 steroids by thin-layer and gas-liquid chromatography and mass spectrometry, J. Chromatogr., 1977, 140, 3, 229-244, https://doi.org/10.1016/S0021-9673(00)93582-9 . [all data]