Silane, methylvinyl(4-methylpent-2-yloxy)(methylvinylpentadecyloxysilyloxy)-

Van Den Dool and Kratz RI, non-polar column, temperature ramp

Data compiled by: NIST Mass Spectrometry Data Center, William E. Wallace, director

Column type Capillary
Active phase 5 % Phenyl methyl siloxane
Column length (m) 30.
Carrier gas
Substrate
Column diameter (mm) 0.25
Phase thickness (μm) 0.25
Tstart (C) 60.
Tend (C) 270.
Heat rate (K/min) 15.
Initial hold (min)
Final hold (min) 15.
I 2512.
ReferenceZaikin, 2014
Comment MSDC-RI

References

Zaikin, 2014
Zaikin, V.G., Personal communication: Retention indices measured during 2014, 2014. [all data]