Tricyclo[4.2.1.0(2,5)]non-7-ene-3,3-diylbis(trimethylsilane)

Van Den Dool and Kratz RI, non-polar column, temperature ramp

View large format table.

Column type Active phase I Reference Comment
Capillary5 % Phenyl methyl siloxane2528.Zaikin, 201330. m/0.25 mm/0.25 μm, 15. K/min, 270. C @ 15. min; Tstart: 60. C

References

Zaikin, 2013
Zaikin, V.G., Personal communication: Retention indices measured during 2013, 2013. [all data]