17α-Hydroxyprogesterone, bis(O-methyloxime)

Kovats' RI, non-polar column, isothermal

Data compiled by: NIST Mass Spectrometry Data Center, William E. Wallace, director

Column type Packed
Active phase OV-1
Column length (m) 2.
Carrier gas N2
Substrate Gas Chrom Q (100-120 mesh)
Column diameter (mm)
Phase thickness (μm)
Temperature (C) 250.
I 2960.
ReferenceBaillie, Brooks, et al., 1972
Comment MSDC-RI

References

Baillie, Brooks, et al., 1972
Baillie, T.A.; Brooks, C.J.W.; Middleditch, B.S., Comparison of Corticosteroid Derivatives by Gas-Chromatography-Mass Spectrometry, Anal. Chem., 1972, 44, 1, 30-37, https://doi.org/10.1021/ac60309a016 . [all data]