Glutaric acid, 2-methylpent-3-yl 1-phenylpropyl ester

Van Den Dool and Kratz RI, non-polar column, temperature ramp

Data compiled by: NIST Mass Spectrometry Data Center, William E. Wallace, director

Column type Capillary
Active phase 5 % Phenyl methyl siloxane
Column length (m) 30.
Carrier gas
Substrate
Column diameter (mm) 0.25
Phase thickness (μm) 0.25
Tstart (C) 60.
Tend (C) 270.
Heat rate (K/min) 15.
Initial hold (min)
Final hold (min) 15.
I 2210.
ReferenceZaikin, 2012
Comment MSDC-RI

References

Zaikin, 2012
Zaikin, V.G., Personal communication: Retention indices measured during 2012, 2012. [all data]