Succinic acid, 2-fluorophenyl oct-1-en-3-yl ester

Van Den Dool and Kratz RI, non-polar column, temperature ramp

View large format table.

Column type Active phase I Reference Comment
Capillary5 % Phenyl methyl siloxane2176.Zaikin, 201230. m/0.25 mm/0.25 μm, 15. K/min, 270. C @ 15. min; Tstart: 60. C

References

Zaikin, 2012
Zaikin, V.G., Personal communication: Retention indices measured during 2012, 2012. [all data]