Verbenyl angelate, cis-

Normal alkane RI, polar column, temperature ramp

View large format table.

Column type Active phase I Reference Comment
CapillaryCarbowax PEG CB1654.Adams and Dev, 201030. m/0.25 mm/0.25 μm, Helium, 3. K/min; Tstart: 60. C; Tend: 246. C

References

Adams and Dev, 2010
Adams, R.P.; Dev, V., Synthesis and GC-MS analysis of angelates and tiglates as an aid to identification of these components in essential oils, Flavour Fragr. J., 2010, 25, 2, 71-74, https://doi.org/10.1002/ffj.1968 . [all data]