Glycine, 2-cyclohexyl-N-(but-3-en-1-yl)oxycarbonyl-, tetradecyl ester

Van Den Dool and Kratz RI, non-polar column, temperature ramp

View large format table.

Column type Active phase I Reference Comment
Capillary5 % Phenyl methyl siloxane3079.Zaikin, 201130. m/0.25 mm/0.25 μm, 15. K/min, 270. C @ 15. min; Tstart: 60. C

References

Zaikin, 2011
Zaikin, V.G., Personal communication: Retention indices measured during 2011, 2011. [all data]