cis-Cyclohex-4-en-1,2-dicarboxylic acid, heptyl phenethyl ester

Van Den Dool and Kratz RI, non-polar column, temperature ramp

Data compiled by: NIST Mass Spectrometry Data Center, William E. Wallace, director

Column type Capillary
Active phase 5 % Phenyl methyl siloxane
Column length (m) 30.
Carrier gas
Substrate
Column diameter (mm) 0.25
Phase thickness (μm) 0.25
Tstart (C) 60.
Tend (C) 270.
Heat rate (K/min) 15.
Initial hold (min)
Final hold (min) 15.
I 2710.
ReferenceZaikin, 2011
Comment MSDC-RI

References

Zaikin, 2011
Zaikin, V.G., Personal communication: Retention indices measured during 2011, 2011. [all data]