D-Glucurono-γ-lactone (isomer 1), 3TMS derivative

Van Den Dool and Kratz RI, non-polar column, temperature ramp

View large format table.

Column type Active phase I Reference Comment
CapillaryVF-5MS1815.6Tretyakov, 201130. m/0.25 mm/0.25 μm, He; Tstart: 60. C; Tend: 270. C

References

Tretyakov, 2011
Tretyakov, K.V., Retention Data (March 2011). NIST Mass Spectrometry Data Center., NIST Mass Spectrometry Data Center, 2011. [all data]