D-Pinitol, pentakis(trimethylsilyl) ether

Van Den Dool and Kratz RI, non-polar column, temperature ramp

View large format table.

Column type Active phase I Reference Comment
CapillaryVF-5MS1815.3Tretyakov, 201130. m/0.25 mm/0.25 μm, He; Tstart: 60. C; Tend: 270. C

Normal alkane RI, non-polar column, custom temperature program

View large format table.

Column type Active phase I Reference Comment
CapillaryPolydimethyl siloxane1814.Supplemental Table S3, 2012Program: not specified

References

Tretyakov, 2011
Tretyakov, K.V., Retention Data (March 2011). NIST Mass Spectrometry Data Center., NIST Mass Spectrometry Data Center, 2011. [all data]

Supplemental Table S3, 2012
Supplemental Table S3, Manually identified analytes present in all three independent not-lethal salt stress acclimation experiments, 2012, retrieved from www.plosone.org/article/fetchSingleRepresentation.action?uri. [all data]