N-acetyl-4-Iodo-2,5-dimethoxyphenethylamine

Kovats' RI, non-polar column, temperature ramp

Data compiled by: NIST Mass Spectrometry Data Center, William E. Wallace, director

Column type Capillary
Active phase HP-1
Column length (m) 12.
Carrier gas He
Substrate
Column diameter (mm) 0.2
Phase thickness (μm) 0.33
Tstart (C) 100.
Tend (C) 310.
Heat rate (K/min) 30.
Initial hold (min) 3.
Final hold (min) 8.
I 2260.
ReferenceTheobald, Pütz, et al., 2006
Comment MSDC-RI

References

Theobald, Pütz, et al., 2006
Theobald, D.S.; Pütz, M.; Schneider, E.; Maurer, H.H., New designer drug 4-iodo-2,5-dimethoxy-β-phenethylamine (2C-I): Studies on its metabolism and toxicological detection in rat urine using gas chromatographic/mass spectrometric and capillary electrophoretic/mass spectrometric techniques, J. Mass Spectrom., 2006, 41, 7, 872-886, https://doi.org/10.1002/jms.1045 . [all data]