1-(4-methylthiophenyl)-2-propanone

Kovats' RI, non-polar column, temperature ramp

View large format table.

Column type Active phase I Reference Comment
CapillaryHP-11335.Ewald, Peters, et al., 200512. m/0.2 mm/0.33 μm, He, 100. C @ 3. min, 30. K/min, 310. C @ 8. min

References

Ewald, Peters, et al., 2005
Ewald, A.H.; Peters, F.T.; Weise, M.; Maurer, H.H., Studies on the metabolism and toxicological detection of the designer drug 4-methylthioamphetamine (4-MTA) in human urine using gas chromatography?mass spectrometry, J. Chromatogr. B, 2005, 824, 1-2, 123-131, https://doi.org/10.1016/j.jchromb.2005.07.007 . [all data]