(Z)-Trimethylsilyl 7-((2R,3R,4S)-4,6-bis(trimethylsilyloxy)-2-[(S,E)-3-(trimethylsilyloxy)oct-1-enyl]-tetrahydro-2H-pyran-3-yl)hept-5-enoate

Van Den Dool and Kratz RI, non-polar column, temperature ramp

Data compiled by: NIST Mass Spectrometry Data Center, William E. Wallace, director

Column type Capillary
Active phase VF-5MS
Column length (m) 30.
Carrier gas He
Substrate
Column diameter (mm) 0.25
Phase thickness (μm) 0.25
Tstart (C) 60.
Tend (C) 270.
Heat rate (K/min)
Initial hold (min)
Final hold (min)
I 2844.
ReferenceZheng, 2011
Comment MSDC-RI

References

Zheng, 2011
Zheng, Yufang, Retention Data. NIST Mass Spectrometry Data Center., NIST Mass Spectrometry Data Center, 2011. [all data]