3-(3,3,5,5-Tetramethyl-2,4,6,9-tetraoxa-3,5-disilaundec-1-yl)pyridine

Van Den Dool and Kratz RI, non-polar column, custom temperature program

View large format table.

Column type Active phase I Reference Comment
CapillaryVF-5MS1791.Tretyakov, 201130. m/0.25 mm/0.25 μm, He; Program: Multi-step temperature program; T(initial)=60C; T(final)=270C

References

Tretyakov, 2011
Tretyakov, K.V., Retention Data. NIST Mass Spectrometry Data Center., NIST Mass Spectrometry Data Center, 2011. [all data]