Desipramine, N-heptafluorobutyryl-

Van Den Dool and Kratz RI, non-polar column, temperature ramp

View large format table.

Column type Active phase I Reference Comment
CapillaryVF-5MS2487.Todua, 201130. m/0.25 mm/0.25 μm, He; Tstart: 60. C; Tend: 270. C

References

Todua, 2011
Todua, N.G., Retention Data. NIST Mass Spectrometry Data Center., NIST Mass Spectrometry Data Center, 2011. [all data]