2-Adamantylamine, N,N-dimethyl-

Kovats' RI, non-polar column, isothermal

Data compiled by: NIST Mass Spectrometry Data Center, William E. Wallace, director

Column type PackedPackedPackedPacked
Active phase OV-101Apiezon LOV-101Apiezon L
Column length (m) 1.1.1.1.
Carrier gas N2N2
Substrate Chromaton N-AWChromaton N-AWChromaton N-AWChromaton N-AW
Column diameter (mm)
Phase thickness (μm)
Temperature (C) 200.200.200.200.
I 1415.1365.1415.1365.
ReferenceKurbatova, Yashkin, et al., 1999Kurbatova, Yashkin, et al., 1999Kurbatova, Moiseev, et al., 1998Kurbatova, Moiseev, et al., 1998
Comment MSDC-RI MSDC-RI MSDC-RI MSDC-RI

References

Kurbatova, Yashkin, et al., 1999
Kurbatova, S.V.; Yashkin, S.N.; Moiseev, I.K.; Zemtsova, M.N., A study of the cell effect for adamantane derivatives by gas-liquid chromatography, Russ. J. Phys. Chem. (Engl. Transl.), 1999, 73, 9, 1486-1489. [all data]

Kurbatova, Moiseev, et al., 1998
Kurbatova, S.V.; Moiseev, I.K.; Zemtsova, M.N.; Kudryashov, S.Yu., Gas chromatography of aminoadamantanes, J. Anal. Chem. USSR (Engl. Transl.), 1998, 53, 8, 732-734. [all data]