3,7,11-Trimethyldodecylacetate

Van Den Dool and Kratz RI, polar column, custom temperature program

Data compiled by: NIST Mass Spectrometry Data Center, William E. Wallace, director

Column type Capillary
Active phase CP-Wax 52CB
Column length (m) 60.
Carrier gas He
Substrate
Column diameter (mm) 0.25
Phase thickness (μm) 0.25
Program 45C(5min) => 10C/min => 80C => 2C/min => 240C
I 2122.
ReferenceRomeo, Ziino, et al., 2007
Comment MSDC-RI

References

Romeo, Ziino, et al., 2007
Romeo, V.; Ziino, M.; Giuffrrida, D.; Condurso, C.; Verzera, A., Flavour profile of capers (Capparis spinosa L.) from the Eolian Archipelago by HS-SPME/GC?MS, Food Chem., 2007, 101, 3, 1272-1278, https://doi.org/10.1016/j.foodchem.2005.12.029 . [all data]