1,7-di-iso-propylnaphthalene

Van Den Dool and Kratz RI, non-polar column, temperature ramp

Data compiled by: NIST Mass Spectrometry Data Center, William E. Wallace, director

Column type Capillary
Active phase BPX-5
Column length (m) 30.
Carrier gas He
Substrate
Column diameter (mm) 0.25
Phase thickness (μm) 0.25
Tstart (C) 60.
Tend (C) 300.
Heat rate (K/min) 3.
Initial hold (min) 3.
Final hold (min)
I 1667.
ReferenceFranke, Grunenberg, et al., 2007
Comment MSDC-RI

References

Franke, Grunenberg, et al., 2007
Franke, S.; Grunenberg, J.; Schwarzbauer, J., The isomer-specific analysis of di-iso-propylnaphthalenes, Int. J. Environ. Anal. Chem., 2007, 87, 6, 437-448, https://doi.org/10.1080/03067310601025221 . [all data]