(E)-Hex-3-enyl 3,5-dinitrobenzoate

Kovats' RI, polar column, isothermal

Data compiled by: NIST Mass Spectrometry Data Center, William E. Wallace, director

Column type CapillaryCapillaryCapillary
Active phase OV-351OV-351OV-351
Column length (m) 25.25.25.
Carrier gas N2N2N2
Substrate
Column diameter (mm) 0.220.220.22
Phase thickness (μm)
Temperature (C) 180.200.220.
I 3084.3104.3125.
ReferenceKorhonen, 1986Korhonen, 1986Korhonen, 1986
Comment MSDC-RI MSDC-RI MSDC-RI

Kovats' RI, non-polar column, isothermal

View large format table.

Column type Active phase Temperature (C) I Reference Comment
CapillarySE-30140.2119.Korhonen, 1986N2; Column length: 25. m; Column diameter: 0.22 mm
CapillarySE-30160.2134.Korhonen, 1986N2; Column length: 25. m; Column diameter: 0.22 mm
CapillarySE-30180.2144.Korhonen, 1986N2; Column length: 25. m; Column diameter: 0.22 mm

Van Den Dool and Kratz RI, polar column, temperature ramp

View large format table.

Column type Active phase I Reference Comment
CapillaryOV-3513116.Korhonen, 1986N2, 6. K/min; Column length: 25. m; Column diameter: 0.22 mm; Tstart: 100. C; Tend: 220. C

Normal alkane RI, non-polar column, temperature ramp

View large format table.

Column type Active phase I Reference Comment
CapillarySE-302156.Korhonen, 1986N2, 6. K/min; Column length: 25. m; Column diameter: 0.22 mm; Tstart: 100. C

References

Korhonen, 1986
Korhonen, I.O.O., Gas-Liquid Chromatographic Analyses. XLVII. Retention Increments of Some Lower Saturated Branched-Chain, Unsaturated and Chlorinated Esters of Benzoic, 4-Nitrobenzoic and 3,5-Dinitrobenzoic Acids on SE-30 and OV-351 Capillary Columns, J. Chromatogr., 1986, 360, 63-78, https://doi.org/10.1016/S0021-9673(00)91652-2 . [all data]