N,N'-[Methylenebis(2-chloro-4,1-phenylene)]bis(2,2,3,3,4,4,4-heptafluorobutanamide)

Van Den Dool and Kratz RI, non-polar column, temperature ramp

View large format table.

Column type Active phase I Reference Comment
CapillaryVF-5MS2468.N/A30. m/0.25 mm/0.25 μm, He; Tstart: 60. C; Tend: 270. C

References

No reference data available.