N-(2,2,3,3,3-Pentafluoropropanoyl)-N-(4-((2,2,3,3,3-pentafluoropropanoyl)amino)phenyl)-2,2,3,3,3-pentafluoropropanamide

Van Den Dool and Kratz RI, non-polar column, temperature ramp

View large format table.

Column type Active phase I Reference Comment
CapillaryVF-5MS1386.N/A30. m/0.25 mm/0.25 μm, He; Tstart: 60. C; Tend: 270. C

References

No reference data available.