2-Trimethylsilyl-3-trimethylsilylamino-1,2,4-triazole

Van Den Dool and Kratz RI, non-polar column, temperature ramp

Data compiled by: NIST Mass Spectrometry Data Center, William E. Wallace, director

Column type Capillary
Active phase VF-5MS
Column length (m) 30.
Carrier gas He
Substrate
Column diameter (mm) 0.25
Phase thickness (μm) 0.25
Tstart (C) 60.
Tend (C) 270.
Heat rate (K/min)
Initial hold (min)
Final hold (min)
I 1366.
ReferenceN/A
Comment MSDC-RI

References

No reference data available.