7-Chloro-3-methyl-quinoline-8-carboxylic acid, trimethylsilyl ester

Van Den Dool and Kratz RI, non-polar column, temperature ramp

View large format table.

Column type Active phase I Reference Comment
CapillaryVF-5MS2090.N/A30. m/0.25 mm/0.25 μm, He; Tstart: 60. C; Tend: 270. C

References

No reference data available.