Diethylmalonic acid, 4-biphenyl propyl ester

Van Den Dool and Kratz RI, non-polar column, temperature ramp

View large format table.

Column type Active phase I Reference Comment
Capillary5 % Phenyl methyl siloxane2549.Zaikin, 201030. m/0.25 mm/0.25 μm, 15. K/min, 270. C @ 15. min; Tstart: 60. C

References

Zaikin, 2010
Zaikin, V.G., Personal communication: Retention indices measured during 2010, 2010. [all data]