12,13-Epoxy-11-hydroxyoctadec-9-enoic acid, methyl ester, trimethylsilyl ether

Kovats' RI, non-polar column, temperature ramp

Data compiled by: NIST Mass Spectrometry Data Center, William E. Wallace, director

Column type Capillary
Active phase DB-1
Column length (m) 30.
Carrier gas H2
Substrate
Column diameter (mm) 0.32
Phase thickness (μm) 0.10
Tstart (C) 60.
Tend (C) 280.
Heat rate (K/min) 3.
Initial hold (min) 5.
Final hold (min) 15.
I 2395.
ReferenceSpiteller, Kern, et al., 2001
Comment MSDC-RI

References

Spiteller, Kern, et al., 2001
Spiteller, P.; Kern, W.; Reiner, J.; Spiteller, G., Aldehydic lipid peroxidation products derived from linoleic acid, Biochim. Biophys. Acta, 2001, 1531, 3, 188-208, https://doi.org/10.1016/S1388-1981(01)00100-7 . [all data]