Benzoic acid, 3-methylbut-2-yl ester

Kovats' RI, non-polar column, isothermal

View large format table.

Column type Active phase Temperature (C) I Reference Comment
CapillarySE-30140.1375.Korhonen, 1986N2; Column length: 25. m; Column diameter: 0.22 mm
CapillarySE-30160.1355.Korhonen, 1986N2; Column length: 25. m; Column diameter: 0.22 mm
CapillarySE-30180.1368.Korhonen, 1986N2; Column length: 25. m; Column diameter: 0.22 mm
CapillarySE-30140.1361.Korhonen and Lind, 1985N2; Column length: 25. m; Column diameter: 0.32 mm
CapillarySE-30160.1367.Korhonen and Lind, 1985N2; Column length: 25. m; Column diameter: 0.32 mm
CapillarySE-30180.1376.Korhonen and Lind, 1985N2; Column length: 25. m; Column diameter: 0.32 mm

Kovats' RI, polar column, isothermal

View large format table.

Column type Active phase Temperature (C) I Reference Comment
CapillaryOV-351180.1827.Korhonen, 1986N2; Column length: 25. m; Column diameter: 0.22 mm
CapillaryOV-351140.1824.Korhonen and Lind, 1985N2; Column length: 25. m; Column diameter: 0.32 mm
CapillaryOV-351160.1833.Korhonen and Lind, 1985N2; Column length: 25. m; Column diameter: 0.32 mm
CapillaryOV-351180.1851.Korhonen and Lind, 1985N2; Column length: 25. m; Column diameter: 0.32 mm

Van Den Dool and Kratz RI, non-polar column, temperature ramp

View large format table.

Column type Active phase I Reference Comment
Capillary5 % Phenyl methyl siloxane1399.Zaikin, 201030. m/0.25 mm/0.25 μm, 15. K/min, 270. C @ 15. min; Tstart: 60. C
CapillarySE-301365.Korhonen and Lind, 1985N2, 10. K/min; Column length: 25. m; Column diameter: 0.32 mm; Tstart: 100. C; Tend: 300. C
CapillarySE-301353.Korhonen and Lind, 1985N2, 2. K/min; Column length: 25. m; Column diameter: 0.32 mm; Tstart: 100. C; Tend: 300. C
CapillarySE-301360.Korhonen and Lind, 1985N2, 6. K/min; Column length: 25. m; Column diameter: 0.32 mm; Tstart: 100. C; Tend: 300. C
CapillarySE-301361.Korhonen, 1985N2, 6. K/min; Column length: 25. m; Column diameter: 0.33 mm; Tstart: 100. C

Van Den Dool and Kratz RI, polar column, temperature ramp

View large format table.

Column type Active phase I Reference Comment
CapillaryOV-3511801.Korhonen, 1986N2, 6. K/min; Column length: 25. m; Column diameter: 0.22 mm; Tstart: 100. C; Tend: 220. C
CapillaryOV-3511840.Korhonen and Lind, 1985N2, 10. K/min; Column length: 25. m; Column diameter: 0.32 mm; Tstart: 100. C; Tend: 230. C
CapillaryOV-3511810.Korhonen and Lind, 1985N2, 2. K/min; Column length: 25. m; Column diameter: 0.32 mm; Tstart: 100. C; Tend: 230. C
CapillaryOV-3511825.Korhonen and Lind, 1985N2, 6. K/min; Column length: 25. m; Column diameter: 0.32 mm; Tstart: 100. C; Tend: 230. C
CapillaryOV-3511816.Korhonen, 1985N2, 6. K/min; Column length: 25. m; Column diameter: 0.32 mm; Tstart: 100. C

Normal alkane RI, non-polar column, temperature ramp

View large format table.

Column type Active phase I Reference Comment
CapillarySE-301356.Korhonen, 1986N2, 6. K/min; Column length: 25. m; Column diameter: 0.22 mm; Tstart: 100. C

References

Korhonen, 1986
Korhonen, I.O.O., Gas-Liquid Chromatographic Analyses. XLVII. Retention Increments of Some Lower Saturated Branched-Chain, Unsaturated and Chlorinated Esters of Benzoic, 4-Nitrobenzoic and 3,5-Dinitrobenzoic Acids on SE-30 and OV-351 Capillary Columns, J. Chromatogr., 1986, 360, 63-78, https://doi.org/10.1016/S0021-9673(00)91652-2 . [all data]

Korhonen and Lind, 1985
Korhonen, I.O.O.; Lind, M.A., Gas-liquid chromatographic analyses. XXXVII. Capillary column studies of benzoyl and monochlorobenzoyl esters of lower saturated branched-chain alcohols, J. Chromatogr., 1985, 323, 2, 331-342, https://doi.org/10.1016/S0021-9673(01)90395-4 . [all data]

Zaikin, 2010
Zaikin, V.G., Personal communication: Retention indices measured during 2010, 2010. [all data]

Korhonen, 1985
Korhonen, I.O.O., Gas-liquid chromatographic analyses. XLIV. Benzoyl and pentafluorobenzoyl esters of lower saturated branched-chain and unsaturated alcohols on SE-30 and OV-351 capillary columns, J. Chromatogr., 1985, 329, 359-369, https://doi.org/10.1016/S0021-9673(01)81942-7 . [all data]