bis(2-methyl-3-thienyl) disulfide

Normal alkane RI, non-polar column, temperature ramp

Data compiled by: NIST Mass Spectrometry Data Center, William E. Wallace, director

Column type CapillaryCapillary
Active phase DB-1DB-1
Column length (m) 60.60.
Carrier gas He
Substrate
Column diameter (mm) 0.320.32
Phase thickness (μm) 0.250.25
Tstart (C) 60.60.
Tend (C) 220.220.
Heat rate (K/min) 3.3.
Initial hold (min)
Final hold (min)
I 1868.1867.
ReferenceGuntert, Brüning, et al., 1990Werkhoff, Bruning, et al., 1990
Comment MSDC-RI MSDC-RI

References

Guntert, Brüning, et al., 1990
Guntert, M.; Brüning, J.; Emberger, R.; Köpsel, Ml; Kuhn, W.; Thielmann, T.; Werkhoff, P., Identification and formation of some selected sulfur-containing flavor compounds in various meat model systems, J. Agric. Food Chem., 1990, 38, 11, 2027-2041, https://doi.org/10.1021/jf00101a007 . [all data]

Werkhoff, Bruning, et al., 1990
Werkhoff, P.; Bruning, J.; Emberger, R.; Guntert, M.; Kopsel, M.; Kuhn, W.; Surburg, H., Isolation and Characterization of Volatile Sulfur-Containing Meat Flavor Components in Model Systems, J. Agric. Food Chem., 1990, 38, 3, 777-791, https://doi.org/10.1021/jf00093a041 . [all data]