1-ethoxy-2,4-hexadiene

Van Den Dool and Kratz RI, non-polar column, temperature ramp

View large format table.

Column type Active phase I Reference Comment
CapillarySPB-1940.Chisholm and Samuels, 199215. m/0.32 mm/0.25 μm, He, 35. C @ 3. min, 6. K/min; Tend: 250. C

References

Chisholm and Samuels, 1992
Chisholm, M.G.; Samuels, J.M., Determination of the impact of the metabolites of sorbic acid on the ordor of a spoiled red wine, J. Agric. Food Chem., 1992, 40, 4, 630-633, https://doi.org/10.1021/jf00016a021 . [all data]