2-furfuryl 2-oxo-3-butyl disulfide

Van Den Dool and Kratz RI, non-polar column, custom temperature program

Data compiled by: NIST Mass Spectrometry Data Center, William E. Wallace, director

Column type CapillaryCapillaryCapillary
Active phase CP-Sil 8CB-MSSE-54SE-54
Column length (m) 60.30.30.
Carrier gas He He
Substrate
Column diameter (mm) 0.250.320.32
Phase thickness (μm) 0.250.250.25
Program 0C(5min) => 40C/min => 40C (2min) => 4C/min => 280C40C(2min) => 40C/min => 50C(5min) => 6C/min => 230C(15min)40C (2min) => 40C/min => 50C (5min) => 6C/min => 230C (15min)
I 1604.1577.1577.
ReferenceElmore, Mottram, et al., 2000Hofmann, Schieberle, et al., 1996Hofmann and Schieberle, 1995
Comment MSDC-RI MSDC-RI MSDC-RI

References

Elmore, Mottram, et al., 2000
Elmore, J.S.; Mottram, D.S.; Enser, M.; Wood, J.D., The effects of diet and breed on the volatile compounds of cooked lamb, Meat Sci., 2000, 55, 2, 149-159, https://doi.org/10.1016/S0309-1740(99)00137-0 . [all data]

Hofmann, Schieberle, et al., 1996
Hofmann, T.; Schieberle, P.; Grosch, W., Model studies on the oxidative stability of odor-active thiols occurring in food flavors, J. Agric. Food Chem., 1996, 44, 1, 251-255, https://doi.org/10.1021/jf9500703 . [all data]

Hofmann and Schieberle, 1995
Hofmann, T.; Schieberle, P., Evaluation of the key odorants in a thermally treated solution of ribose and cysteine by aroma extract dilution techniques, J. Agric. Food Chem., 1995, 43, 8, 2187-2194, https://doi.org/10.1021/jf00056a042 . [all data]