6-methyl-2-pentylpyridine

Normal alkane RI, non-polar column, temperature ramp

View large format table.

Column type Active phase I Reference Comment
CapillaryDB-11221.Lambrecht and Kaulen, 199760. m/0.32 mm/0.25 μm, 4. K/min, 280. C @ 15. min; Tstart: 80. C

Normal alkane RI, non-polar column, custom temperature program

View large format table.

Column type Active phase I Reference Comment
CapillarySE-301249.Li, Gao, et al., 2000Program: not specified

References

Lambrecht and Kaulen, 1997
Lambrecht, S.; Kaulen, J., Synthesis of substituted ethenylpyrazines and dialkylpyridines and their sensory properties, Flavour Fragr. J., 1997, 12, 439-442. [all data]

Li, Gao, et al., 2000
Li, R.; Gao, S.-G.; Xiang, B.-R., Using improved BP neural network in predicting GC retention indices, Computers appl. chem. (Chinese), 2000, 17, 1-2, 113-114. [all data]