5-ethenyl-2-methoxypyrazine

Normal alkane RI, non-polar column, temperature ramp

View large format table.

Column type Active phase I Reference Comment
CapillaryDB-11072.Lambrecht and Kaulen, 199760. m/0.32 mm/0.25 μm, 4. K/min, 280. C @ 15. min; Tstart: 80. C

References

Lambrecht and Kaulen, 1997
Lambrecht, S.; Kaulen, J., Synthesis of substituted ethenylpyrazines and dialkylpyridines and their sensory properties, Flavour Fragr. J., 1997, 12, 439-442. [all data]