4-Chlorobutyric acid, 3-methylbutyl-2 ester

Kovats' RI, non-polar column, isothermal

View large format table.

Column type Active phase Temperature (C) I Reference Comment
CapillarySE-30100.1204.Haken, Madden, et al., 1985N2; Column length: 25. m; Column diameter: 0.33 mm
CapillarySE-30120.1201.Haken, Madden, et al., 1985N2; Column length: 25. m; Column diameter: 0.33 mm
CapillarySE-30140.1227.Haken, Madden, et al., 1985N2; Column length: 25. m; Column diameter: 0.33 mm
CapillarySE-3060.1212.Haken, Madden, et al., 1985N2; Column length: 25. m; Column diameter: 0.33 mm
CapillarySE-3080.1208.Haken, Madden, et al., 1985N2; Column length: 25. m; Column diameter: 0.33 mm

Kovats' RI, polar column, isothermal

View large format table.

Column type Active phase Temperature (C) I Reference Comment
CapillaryOV-351100.1604.Haken, Madden, et al., 1985N2; Column length: 25. m; Column diameter: 0.32 mm
CapillaryOV-351120.1621.Haken, Madden, et al., 1985N2; Column length: 25. m; Column diameter: 0.32 mm
CapillaryOV-35160.1600.Haken, Madden, et al., 1985N2; Column length: 25. m; Column diameter: 0.32 mm
CapillaryOV-35180.1600.Haken, Madden, et al., 1985N2; Column length: 25. m; Column diameter: 0.32 mm

Van Den Dool and Kratz RI, non-polar column, temperature ramp

View large format table.

Column type Active phase I Reference Comment
Capillary5 % Phenyl methyl siloxane1247.Zaikin, 200930. m/0.25 mm/0.25 μm, 15. K/min, 270. C @ 15. min; Tstart: 60. C

References

Haken, Madden, et al., 1985
Haken, J.K.; Madden, B.G.; Korhonen, I.O.O., Gas chromatography of homologous esters. XXXI. Butanoyl and monochlorobutanoyl esters of lower saturated branched chain and unsaturated alcohols on SE-30 and OV-351 capillary columns, J. Chromatogr., 1985, 325, 61-73, https://doi.org/10.1016/S0021-9673(00)96008-4 . [all data]

Zaikin, 2009
Zaikin, V.G., Personal Communication: Retention indices measured during the period 2008 to 2009, 2009. [all data]