1-(4-Trimethylsilyloxycarbonylphenyl)-2-(pyrrolidin-1-yl)-butan-1-one

Kovats' RI, non-polar column, temperature ramp

View large format table.

Column type Active phase I Reference Comment
CapillaryHP-12220.Peters, Meyer, et al., 200512. m/0.2 mm/0.33 μm, He, 100. C @ 3. min, 30. K/min, 310. C @ 8. min

References

Peters, Meyer, et al., 2005
Peters, F.T.; Meyer, M.R.; Fritschi, G.; Maurer, H.H., Studies on the metabolism and toxicological detection of the new designer drug 4'-methyl-α-pyrrolidinobutyrophenone (MPBP) in rat urine using gas chromatography-mass spectrometry, J. Chromatogr. B, 2005, 824, 1-2, 81-91, https://doi.org/10.1016/j.jchromb.2005.07.003 . [all data]