1-(4-Carbomethoxyphenyl)-1,2-butanedione

Kovats' RI, non-polar column, temperature ramp

Data compiled by: NIST Mass Spectrometry Data Center, William E. Wallace, director

Column type Capillary
Active phase HP-1
Column length (m) 12.
Carrier gas He
Substrate
Column diameter (mm) 0.2
Phase thickness (μm) 0.33
Tstart (C) 100.
Tend (C) 310.
Heat rate (K/min) 30.
Initial hold (min) 3.
Final hold (min) 8.
I 1650.
ReferencePeters, Meyer, et al., 2005
Comment MSDC-RI

References

Peters, Meyer, et al., 2005
Peters, F.T.; Meyer, M.R.; Fritschi, G.; Maurer, H.H., Studies on the metabolism and toxicological detection of the new designer drug 4'-methyl-α-pyrrolidinobutyrophenone (MPBP) in rat urine using gas chromatography-mass spectrometry, J. Chromatogr. B, 2005, 824, 1-2, 81-91, https://doi.org/10.1016/j.jchromb.2005.07.003 . [all data]